Reaction Details
TargetTyrosine-protein kinase JAK1
LigandBDBM254981
Substrate/Competitorn/a
Meas. Tech.Enzyme Assay
IC50 0.65±n/a nM
Citation Takahashi, KWatanabe, THayashi, KKurihara, KNakamura, TYamamoto, ANishimura, TKamiyama, THidaka, Y Tricyclic pyrrolopyridine compound, and JAK inhibitor US Patent US9475813 Publication Date 10/25/2016
 
Tyrosine-protein kinase JAK1
Name:Tyrosine-protein kinase JAK1
Type:Protein
Mol. Mass.:133293.73
Organism:Homo sapiens (Human)
Description:P23458
Residue:1154
BDBM254981
NameBDBM254981
Synonyms:US9475813, 37
TypeSmall organic molecule
Emp. Form.C18H25N5O3S
Mol. Mass.391.488
SMILESCN1CN([C@H]2CC[C@H](CNS(C)(=O)=O)CC2)c2c(cnc3[nH]ccc23)C1=O