Reaction Details
TargetTyrosine-protein kinase JAK3
LigandBDBM255013
Substrate/Competitorn/a
Meas. Tech.Enzyme Assay
IC50 43±n/a nM
Citation Takahashi, KWatanabe, THayashi, KKurihara, KNakamura, TYamamoto, ANishimura, TKamiyama, THidaka, Y Tricyclic pyrrolopyridine compound, and JAK inhibitor US Patent US9475813 Publication Date 10/25/2016
 
Tyrosine-protein kinase JAK3
Name:Tyrosine-protein kinase JAK3
Type:Protein
Mol. Mass.:125111.08
Organism:Homo sapiens (Human)
Description:P52333
Residue:1124
BDBM255013
NameBDBM255013
Synonyms:US9475813, 18
TypeSmall organic molecule
Emp. Form.C19H24N6O
Mol. Mass.352.4335
SMILESCN1CN([C@H]2CC[C@H](CNCC#N)CC2)c2c(cnc3[nH]ccc23)C1=O