Reaction Details
TargetNon-receptor tyrosine-protein kinase TYK2
LigandBDBM255013
Substrate/Competitorn/a
Meas. Tech.Enzyme Assay
IC50 42±n/a nM
Citation Takahashi, KWatanabe, THayashi, KKurihara, KNakamura, TYamamoto, ANishimura, TKamiyama, THidaka, Y Tricyclic pyrrolopyridine compound, and JAK inhibitor US Patent US9475813 Publication Date 10/25/2016
 
Non-receptor tyrosine-protein kinase TYK2
Name:Non-receptor tyrosine-protein kinase TYK2
Type:Protein
Mol. Mass.:133666.03
Organism:Homo sapiens (Human)
Description:P29597
Residue:1187
BDBM255013
NameBDBM255013
Synonyms:US9475813, 18
TypeSmall organic molecule
Emp. Form.C19H24N6O
Mol. Mass.352.4335
SMILESCN1CN([C@H]2CC[C@H](CNCC#N)CC2)c2c(cnc3[nH]ccc23)C1=O