Reaction Details
TargetCasein kinase I isoform epsilon
LigandBDBM255204
Substrate/Competitorn/a
Meas. Tech.Kinase Assay
pH7.4±n/a
Temperature298.15±n/a K
IC50 0.6±n/a nM
Commentsextracted
Citation Velaparthi, UDarne, CPDodd, DSLiu, PMussari, CPWittman, MDKumaravel, SMullick, D Pyrazole substituted imidazopyrazines as casein kinase 1 d/e inhibitors US Patent US9475817 Publication Date 10/25/2016
 
Casein kinase I isoform epsilon
Name:Casein kinase I isoform epsilon
Type:Protein
Mol. Mass.:47340.25
Organism:Homo sapiens (Human)
Description:P49674
Residue:416
BDBM255204
NameBDBM255204
Synonyms:US9475817, 163
TypeSmall organic molecule
Emp. Form.C33H35FN10O3
Mol. Mass.638.6946
SMILESCn1nc(c(c1C1CCN(CC(N)=O)CC1)-c1ccc2nc(NC(=O)c3ccnc(c3)N3CCOCC3)cn2n1)-c1ccc(F)cc1