Reaction Details
TargetTransient receptor potential cation channel subfamily M member 8
LigandBDBM256293
Substrate/Competitorn/a
Meas. Tech.Inhibition Assay
Temperature310.15±n/a K
IC50 0.3±n/a nM
Commentsextracted
Citation Kato, TSakamoto, TKubo, ASawamoto, D Sulfonamide compound US Patent US9487488 Publication Date 11/8/2016
 
Transient receptor potential cation channel subfamily M member 8
Name:Transient receptor potential cation channel subfamily M member 8
Type:Enzyme
Mol. Mass.:127693.26
Organism:Homo sapiens (Human)
Description:Q7Z2W7
Residue:1104
BDBM256293
NameBDBM256293
Synonyms:US9487488, 17
TypeSmall organic molecule
Emp. Form.C28H23F3N6O3S
Mol. Mass.580.581
SMILESCc1cc(ccc1-c1nnn[nH]1)S(=O)(=O)N(Cc1ccc(OC(F)(F)F)cc1)c1ncc2ccccc2c1C1CC1