Reaction Details
TargetRAC-alpha serine/threonine-protein kinase
LigandBDBM50427345
Substrate/Competitorn/a
Meas. Tech.In Vitro AKT1 Kinase Assay
pH7.5±n/a
Temperature298.15±n/a K
IC50 5±n/a nM
Commentsextracted
Citation Johnson, PDLeach, ALuke, RWMatusiak, ZSMorris, JJ Protein kinase B inhibitors US Patent US9492453 Publication Date 11/15/2016
 
RAC-alpha serine/threonine-protein kinase
Name:RAC-alpha serine/threonine-protein kinase
Type:Enzyme
Mol. Mass.:55681.25
Organism:Homo sapiens (Human)
Description:P31749
Residue:480
BDBM50427345
NameBDBM50427345
Synonyms:CHEMBL2325983 US11236095, Example 4 | US9492453, 4
TypeSmall organic molecule
Emp. Form.C22H25ClN6O
Mol. Mass.424.927
SMILESNC1(CCN(CC1)c1ncnc2[nH]ccc12)C(=O)NC(C1CC1)c1ccc(Cl)cc1