Reaction Details
TargetRAC-alpha serine/threonine-protein kinase
LigandBDBM256834
Substrate/Competitorn/a
Meas. Tech.In Vitro AKT1 Kinase Assay
pH7.5±n/a
Temperature298.15±n/a K
IC50 4.2±n/a nM
Commentsextracted
Citation Johnson, PDLeach, ALuke, RWMatusiak, ZSMorris, JJ Protein kinase B inhibitors US Patent US9492453 Publication Date 11/15/2016
 
RAC-alpha serine/threonine-protein kinase
Name:RAC-alpha serine/threonine-protein kinase
Type:Enzyme
Mol. Mass.:55681.25
Organism:Homo sapiens (Human)
Description:P31749
Residue:480
BDBM256834
NameBDBM256834
Synonyms:US10654855, Example 13 US9492453, 13
TypeSmall organic molecule
Emp. Form.C21H25ClN6O2
Mol. Mass.428.915
SMILESNC1(CCN(CC1)c1ncnc2[nH]ccc12)C(=O)NC(CCO)c1ccc(Cl)cc1