Reaction Details
TargetRAC-alpha serine/threonine-protein kinase
LigandBDBM256845
Substrate/Competitorn/a
Meas. Tech.In Vitro AKT1 Kinase Assay
pH7.5±n/a
Temperature298.15±n/a K
IC50 5.6±n/a nM
Commentsextracted
Citation Johnson, PDLeach, ALuke, RWMatusiak, ZSMorris, JJ Protein kinase B inhibitors US Patent US9492453 Publication Date 11/15/2016
 
RAC-alpha serine/threonine-protein kinase
Name:RAC-alpha serine/threonine-protein kinase
Type:Enzyme
Mol. Mass.:55681.25
Organism:Homo sapiens (Human)
Description:P31749
Residue:480
BDBM256845
NameBDBM256845
Synonyms:US10654855, Example 26 US9492453, 26
TypeSmall organic molecule
Emp. Form.C25H34ClN7O
Mol. Mass.484.037
SMILESCCN(CC)CC[C@H](NC(=O)C1(N)CCN(CC1)c1ncnc2[nH]ccc12)c1ccc(Cl)cc1