Reaction Details
TargetRAC-alpha serine/threonine-protein kinase
LigandBDBM50427332
Substrate/Competitorn/a
Meas. Tech.In Vitro AKT1 Kinase Assay
pH7.5±n/a
Temperature298.15±n/a K
IC50 5±n/a nM
Commentsextracted
Citation Johnson, PDLeach, ALuke, RWMatusiak, ZSMorris, JJ Protein kinase B inhibitors US Patent US9492453 Publication Date 11/15/2016
 
RAC-alpha serine/threonine-protein kinase
Name:RAC-alpha serine/threonine-protein kinase
Type:Enzyme
Mol. Mass.:55681.25
Organism:Homo sapiens (Human)
Description:P31749
Residue:480
BDBM50427332
NameBDBM50427332
Synonyms:CHEMBL2325996 US11236095, Example 49 | US9492453, 49
TypeSmall organic molecule
Emp. Form.C27H36ClN7O
Mol. Mass.510.074
SMILESNC1(CCN(CC1)c1ncnc2[nH]ccc12)C(=O)NC(CCCN1CCCCC1)c1ccc(Cl)cc1