Reaction Details
TargetRAC-alpha serine/threonine-protein kinase
LigandBDBM256862
Substrate/Competitorn/a
Meas. Tech.In Vitro AKT1 Kinase Assay
pH7.5±n/a
Temperature298.15±n/a K
IC50 4.3±n/a nM
Commentsextracted
Citation Johnson, PDLeach, ALuke, RWMatusiak, ZSMorris, JJ Protein kinase B inhibitors US Patent US9492453 Publication Date 11/15/2016
 
RAC-alpha serine/threonine-protein kinase
Name:RAC-alpha serine/threonine-protein kinase
Type:Enzyme
Mol. Mass.:55681.25
Organism:Homo sapiens (Human)
Description:P31749
Residue:480
BDBM256862
NameBDBM256862
Synonyms:US10654855, Example 50 US9492453, 50
TypeSmall organic molecule
Emp. Form.C26H35ClN8O
Mol. Mass.511.062
SMILESCN1CCN(CC[C@H](NC(=O)C2(N)CCN(CC2)c2ncnc3[nH]ccc23)c2ccc(Cl)cc2)CC1