Reaction Details
TargetLeucine-rich repeat serine/threonine-protein kinase 2 [970-2527,G2019S]
LigandBDBM257371
Substrate/Competitorn/a
Meas. Tech.Km ATP LanthaScreen Assay
pH8.5±n/a
Temperature298.15±n/a K
IC50 0.67±n/a nM
Commentsextracted
Citation Miller, MBasu, KDeMong, DScott, JLi, WStamford, APoirer, MTempest, P Compounds inhibiting leucine-rich repeat kinase enzyme activity US Patent US9493440 Publication Date 11/15/2016
 
Leucine-rich repeat serine/threonine-protein kinase 2 [970-2527,G2019S]
Name:Leucine-rich repeat serine/threonine-protein kinase 2 [970-2527,G2019S]
Type:Protein
Mol. Mass.:177347.59
Organism:Homo sapiens (Human)
Description:Human LRRK2 variant (970-2527aa) with G2019S mutation
Residue:1558
BDBM257371
NameBDBM257371
Synonyms:US9493440, 219
TypeSmall organic molecule
Emp. Form.C21H26N6O3S
Mol. Mass.442.535
SMILESCCC1(CC1)Oc1ccc2[nH]nc(-c3cc(ncn3)N3CCN(CC3)S(C)(=O)=O)c2c1