Reaction Details
TargetPeptidyl-prolyl cis-trans isomerase FKBP1A
LigandBDBM257515
Substrate/Competitorn/a
Meas. Tech.PPlase Assay
Ki 5.9±0.66 nM
Citation Gregory, MAKendrew, SGMoss, SJWilkinson, B Rapamycin analogues and their pharmaceutical use US Patent US9505773 Publication Date 11/29/2016
 
Peptidyl-prolyl cis-trans isomerase FKBP1A
Name:Peptidyl-prolyl cis-trans isomerase FKBP1A
Type:Isomerase
Mol. Mass.:11953.09
Organism:Homo sapiens (Human)
Description:P62942
Residue:108
BDBM257515
NameBDBM257515
Synonyms:US9505773, 8
TypeSmall organic molecule
Emp. Form.C47H73NO11
Mol. Mass.828.0826
SMILESCO[C@@H]1C[C@H](C[C@@H](C)C2C\C=C(C)\[C@@H](O)CC(=O)[C@H](C)C[C@H](C)\C=C\C=C\C=C(C)\[C@H](C[C@@H]3CC[C@@H](C)[C@@](O)(O3)C(=O)C(=O)N3CCCC[C@H]3C(=O)O2)OC)CC[C@H]1O