Reaction Details
TargetPeptidyl-prolyl cis-trans isomerase FKBP1A
LigandBDBM257519
Substrate/Competitorn/a
Meas. Tech.PPlase Assay
Ki 9.5±0.73 nM
Citation Gregory, MAKendrew, SGMoss, SJWilkinson, B Rapamycin analogues and their pharmaceutical use US Patent US9505773 Publication Date 11/29/2016
 
Peptidyl-prolyl cis-trans isomerase FKBP1A
Name:Peptidyl-prolyl cis-trans isomerase FKBP1A
Type:Isomerase
Mol. Mass.:11953.09
Organism:Homo sapiens (Human)
Description:P62942
Residue:108
BDBM257519
NameBDBM257519
Synonyms:US9505773, 12
TypeSmall organic molecule
Emp. Form.C45H65NO10S
Mol. Mass.812.063
SMILESCO[C@H]1C[C@@H]2CC[C@@H](C)[C@@](O)(O2)C(=O)C(=O)N2CCCC[C@H]2C(=O)OC(C\C=C(C)\[C@@H](O)CC(=O)[C@H](C)C[C@H](C)\C=C\C=C\C=C1/C)[C@H](C)Cc1ccc(CO)s1