Reaction Details
TargetSodium channel protein type 9 subunit alpha
LigandBDBM258099
Substrate/Competitorn/a
Meas. Tech.Electrophysiological Assay
pH7.3±n/a
Temperature310.15±n/a K
IC50 20±n/a nM
Commentsextracted
Citation Shinozuka, TKobayashi, HSuzuki, STanaka, KKimoto, HDomon, Y Cycloalkane derivatives US Patent US9493448 Publication Date 11/15/2016
 
Sodium channel protein type 9 subunit alpha
Name:Sodium channel protein type 9 subunit alpha
Type:Protein
Mol. Mass.:226375.97
Organism:Homo sapiens (Human)
Description:Q15858
Residue:1988
BDBM258099
NameBDBM258099
Synonyms:US9493448, 1 US9493448, 3 US9845313, Example 2
TypeSmall organic molecule
Emp. Form.C20H19F2N3O3S2
Mol. Mass.451.51
SMILESFc1cc(c(F)cc1O[C@H]1CCCC[C@@H]1c1ccccc1)S(=O)(=O)Nc1ncns1