Reaction Details
TargetSodium channel protein type 9 subunit alpha
LigandBDBM258249
Substrate/Competitorn/a
Meas. Tech.Electrophysiological Assay
pH7.3±n/a
Temperature310.15±n/a K
IC50 28±n/a nM
Commentsextracted
Citation Shinozuka, TKobayashi, HSuzuki, STanaka, KKimoto, HDomon, Y Cycloalkane derivatives US Patent US9493448 Publication Date 11/15/2016
 
Sodium channel protein type 9 subunit alpha
Name:Sodium channel protein type 9 subunit alpha
Type:Protein
Mol. Mass.:226375.97
Organism:Homo sapiens (Human)
Description:Q15858
Residue:1988
BDBM258249
NameBDBM258249
Synonyms:US9493448, 158 | US9597330, Example 59
TypeSmall organic molecule
Emp. Form.C19H19ClFN5O3S
Mol. Mass.451.902
SMILESFc1cc(O[C@H]2CCCC[C@@H]2c2ccn[nH]2)c(Cl)cc1S(=O)(=O)Nc1ccncn1