Reaction Details
TargetAcetylcholinesterase
LigandBDBM258433
Substrate/Competitorn/a
Meas. Tech.Ellman Assay
pH8±n/a
IC50>100000±n/a nM
Commentsextracted
Citation Laskin, JDHeindel, NDHeck, DELacey, CJYoung, SC Augmenting moieties for anti-inflammatory compounds US Patent US9512068 Publication Date 12/6/2016
 
Acetylcholinesterase
Name:Acetylcholinesterase
Type:Enzyme
Mol. Mass.:71812.79
Organism:Electrophorus electricus (Electric eel)
Description:n/a
Residue:633
BDBM258433
NameBDBM258433
Synonyms:US9512068, NDH4618
TypeSmall organic molecule
Emp. Form.C25H33NO4
Mol. Mass.411.5338
SMILESCOc1ccc2cc(ccc2c1)[C@H](C)C(=O)N1CCC[C@H]1C(=O)OCCC(C)(C)C