Reaction Details
TargetAcetylcholinesterase
LigandBDBM258435
Substrate/Competitorn/a
Meas. Tech.Ellman Assay
pH8±n/a
IC50 15400±100 nM
Commentsextracted
Citation Laskin, JDHeindel, NDHeck, DELacey, CJYoung, SC Augmenting moieties for anti-inflammatory compounds US Patent US9512068 Publication Date 12/6/2016
 
Acetylcholinesterase
Name:Acetylcholinesterase
Type:Enzyme
Mol. Mass.:71812.79
Organism:Electrophorus electricus (Electric eel)
Description:n/a
Residue:633
BDBM258435
NameBDBM258435
Synonyms:US9512068, NDH4628
TypeSmall organic molecule
Emp. Form.C25H30Cl2N2O3
Mol. Mass.477.423
SMILESCC(C)(C)CCOC(=O)[C@@H]1CCCN1C(=O)Cc1ccccc1Nc1c(Cl)cccc1Cl