Reaction Details
TargetAcetylcholinesterase
LigandBDBM258430
Substrate/Competitorn/a
Meas. Tech.Ellman Assay
pH8±n/a
IC50 27900±2700 nM
Commentsextracted
Citation Laskin, JDHeindel, NDHeck, DELacey, CJYoung, SC Augmenting moieties for anti-inflammatory compounds US Patent US9512068 Publication Date 12/6/2016
 
Acetylcholinesterase
Name:Acetylcholinesterase
Type:Enzyme
Mol. Mass.:71812.79
Organism:Electrophorus electricus (Electric eel)
Description:n/a
Residue:633
BDBM258430
NameBDBM258430
Synonyms:US9512068, NDH4614
TypeSmall organic molecule
Emp. Form.C21H33NO3
Mol. Mass.347.4916
SMILESCC(C)Cc1ccc(cc1)C(C)C(=O)NCC(=O)OCCC(C)(C)C