Reaction Details
TargetAcetylcholinesterase
LigandBDBM258431
Substrate/Competitorn/a
Meas. Tech.Ellman Assay
pH8±n/a
IC50 6630±400 nM
Commentsextracted
Citation Laskin, JDHeindel, NDHeck, DELacey, CJYoung, SC Augmenting moieties for anti-inflammatory compounds US Patent US9512068 Publication Date 12/6/2016
 
Acetylcholinesterase
Name:Acetylcholinesterase
Type:Enzyme
Mol. Mass.:71812.79
Organism:Electrophorus electricus (Electric eel)
Description:n/a
Residue:633
BDBM258431
NameBDBM258431
Synonyms:US9512068, NDH4615
TypeSmall organic molecule
Emp. Form.C27H31ClN2O5
Mol. Mass.498.998
SMILESCOc1ccc2n(C(=O)c3ccc(Cl)cc3)c(C)c(CC(=O)NCC(=O)OCCC(C)(C)C)c2c1