Reaction Details
TargetAcetylcholinesterase
LigandBDBM258434
Substrate/Competitorn/a
Meas. Tech.Ellman Assay
pH8±n/a
IC50>50000±n/a nM
Commentsextracted
Citation Laskin, JDHeindel, NDHeck, DELacey, CJYoung, SC Augmenting moieties for anti-inflammatory compounds US Patent US9512068 Publication Date 12/6/2016
 
Acetylcholinesterase
Name:Acetylcholinesterase
Type:Enzyme
Mol. Mass.:71812.79
Organism:Electrophorus electricus (Electric eel)
Description:n/a
Residue:633
BDBM258434
NameBDBM258434
Synonyms:US9512068, NDH4627
TypeSmall organic molecule
Emp. Form.C22H26Cl2N2O3
Mol. Mass.437.359
SMILESCC(C)(C)CCOC(=O)CNC(=O)Cc1ccccc1Nc1c(Cl)cccc1Cl