Reaction Details
TargetAcetylcholinesterase
LigandBDBM258424
Substrate/Competitorn/a
Meas. Tech.Ellman Assay
pH8±n/a
IC50 4340±200 nM
Commentsextracted
Citation Laskin, JDHeindel, NDHeck, DELacey, CJYoung, SC Augmenting moieties for anti-inflammatory compounds US Patent US9512068 Publication Date 12/6/2016
 
Acetylcholinesterase
Name:Acetylcholinesterase
Type:Enzyme
Mol. Mass.:71812.79
Organism:Electrophorus electricus (Electric eel)
Description:n/a
Residue:633
BDBM258424
NameBDBM258424
Synonyms:US9512068, NDH4576
TypeSmall organic molecule
Emp. Form.C28H39NO3
Mol. Mass.437.6142
SMILESCC(C)Cc1ccc(cc1)C(C)C(=O)N[C@@H](Cc1ccccc1)C(=O)OCCC(C)(C)C