Reaction Details
TargetAcetylcholinesterase
LigandBDBM258423
Substrate/Competitorn/a
Meas. Tech.Ellman Assay
pH8±n/a
IC50 4770±200 nM
Commentsextracted
Citation Laskin, JDHeindel, NDHeck, DELacey, CJYoung, SC Augmenting moieties for anti-inflammatory compounds US Patent US9512068 Publication Date 12/6/2016
 
Acetylcholinesterase
Name:Acetylcholinesterase
Type:Enzyme
Mol. Mass.:71812.79
Organism:Electrophorus electricus (Electric eel)
Description:n/a
Residue:633
BDBM258423
NameBDBM258423
Synonyms:US9512068, NDH4572
TypeSmall organic molecule
Emp. Form.C29H35NO4
Mol. Mass.461.5925
SMILESCOc1ccc2cc(ccc2c1)[C@H](C)C(=O)N[C@@H](Cc1ccccc1)C(=O)OCCC(C)(C)C