Reaction Details
TargetAcetylcholinesterase
LigandBDBM258426
Substrate/Competitorn/a
Meas. Tech.Ellman Assay
pH8±n/a
IC50 1310±100 nM
Commentsextracted
Citation Laskin, JDHeindel, NDHeck, DELacey, CJYoung, SC Augmenting moieties for anti-inflammatory compounds US Patent US9512068 Publication Date 12/6/2016
 
Acetylcholinesterase
Name:Acetylcholinesterase
Type:Enzyme
Mol. Mass.:71812.79
Organism:Electrophorus electricus (Electric eel)
Description:n/a
Residue:633
BDBM258426
NameBDBM258426
Synonyms:US9512068, NDH4578
TypeSmall organic molecule
Emp. Form.C29H32Cl2N2O3
Mol. Mass.527.482
SMILESCC(C)(C)CCOC(=O)[C@H](Cc1ccccc1)NC(=O)Cc1ccccc1Nc1c(Cl)cccc1Cl