Reaction Details
TargetAcetylcholinesterase
LigandBDBM258428
Substrate/Competitorn/a
Meas. Tech.Ellman Assay
pH8±n/a
IC50 8910±400 nM
Commentsextracted
Citation Laskin, JDHeindel, NDHeck, DELacey, CJYoung, SC Augmenting moieties for anti-inflammatory compounds US Patent US9512068 Publication Date 12/6/2016
 
Acetylcholinesterase
Name:Acetylcholinesterase
Type:Enzyme
Mol. Mass.:71812.79
Organism:Electrophorus electricus (Electric eel)
Description:n/a
Residue:633
BDBM258428
NameBDBM258428
Synonyms:US9512068, NDH4595
TypeSmall organic molecule
Emp. Form.C24H39NO3
Mol. Mass.389.5714
SMILESCC(C)Cc1ccc(cc1)C(C)C(=O)N[C@@H](C(C)C)C(=O)OCCC(C)(C)C