Reaction Details
TargetAcetylcholinesterase
LigandBDBM258429
Substrate/Competitorn/a
Meas. Tech.Ellman Assay
pH8±n/a
IC50 18600±3000 nM
Commentsextracted
Citation Laskin, JDHeindel, NDHeck, DELacey, CJYoung, SC Augmenting moieties for anti-inflammatory compounds US Patent US9512068 Publication Date 12/6/2016
 
Acetylcholinesterase
Name:Acetylcholinesterase
Type:Enzyme
Mol. Mass.:71812.79
Organism:Electrophorus electricus (Electric eel)
Description:n/a
Residue:633
BDBM258429
NameBDBM258429
Synonyms:US9512068, NDH4596
TypeSmall organic molecule
Emp. Form.C25H35NO4
Mol. Mass.413.5497
SMILESCOc1ccc2cc(ccc2c1)[C@H](C)C(=O)N[C@@H](C(C)C)C(=O)OCCC(C)(C)C