Reaction Details
TargetAcetylcholinesterase
LigandBDBM258422
Substrate/Competitorn/a
Meas. Tech.Ellman Assay
pH8±n/a
IC50 3290±300 nM
Commentsextracted
Citation Laskin, JDHeindel, NDHeck, DELacey, CJYoung, SC Augmenting moieties for anti-inflammatory compounds US Patent US9512068 Publication Date 12/6/2016
 
Acetylcholinesterase
Name:Acetylcholinesterase
Type:Enzyme
Mol. Mass.:71812.79
Organism:Electrophorus electricus (Electric eel)
Description:n/a
Residue:633
BDBM258422
NameBDBM258422
Synonyms:US9512068, NDH4537
TypeSmall organic molecule
Emp. Form.C30H37ClN2O5
Mol. Mass.541.078
SMILESCOc1ccc2n(C(=O)c3ccc(Cl)cc3)c(C)c(CC(=O)N[C@@H](C(C)C)C(=O)OCCC(C)(C)C)c2c1