Reaction Details
TargetAcetylcholinesterase
LigandBDBM258427
Substrate/Competitorn/a
Meas. Tech.Ellman Assay
pH8±n/a
IC50 1850±100 nM
Commentsextracted
Citation Laskin, JDHeindel, NDHeck, DELacey, CJYoung, SC Augmenting moieties for anti-inflammatory compounds US Patent US9512068 Publication Date 12/6/2016
 
Acetylcholinesterase
Name:Acetylcholinesterase
Type:Enzyme
Mol. Mass.:71812.79
Organism:Electrophorus electricus (Electric eel)
Description:n/a
Residue:633
BDBM258427
NameBDBM258427
Synonyms:US9512068, NDH4591
TypeSmall organic molecule
Emp. Form.C25H32Cl2N2O3
Mol. Mass.479.439
SMILESCC(C)[C@H](NC(=O)Cc1ccccc1Nc1c(Cl)cccc1Cl)C(=O)OCCC(C)(C)C