Reaction Details
TargetSphingosine 1-phosphate receptor 1
LigandBDBM65173
Substrate/Competitorn/a
Meas. Tech.[35S] GTPgammaS Binding Assays
Temperature333.15±n/a K
EC50 55±n/a nM
Commentsextracted
Citation Dyckman, AJDhar, TGXiao, HGilmore, JLYang, MGXiao, ZMarcoux, D Substituted bicyclic compounds US Patent US9522888 Publication Date 12/20/2016
 
Sphingosine 1-phosphate receptor 1
Name:Sphingosine 1-phosphate receptor 1
Type:Enzyme
Mol. Mass.:42836.02
Organism:Homo sapiens (Human)
Description:P21453
Residue:382
BDBM65173
NameBDBM65173
Synonyms:US10166249, Example 522 | US9522888, 522
Typen/a
Emp. Form.C25H34NO4PS
Mol. Mass.475.581
SMILESN[C@]1(COP(O)(O)=O)CC[C@@H](C1)c1ccc2C[C@H](CSCCc3ccccc3)CCc2c1