Reaction Details
TargetSphingosine 1-phosphate receptor 1
LigandBDBM65195
Substrate/Competitorn/a
Meas. Tech.[35S] GTPgammaS Binding Assays
Temperature333.15±n/a K
EC50<10±n/a nM
Commentsextracted
Citation Dyckman, AJDhar, TGXiao, HGilmore, JLYang, MGXiao, ZMarcoux, D Substituted bicyclic compounds US Patent US9522888 Publication Date 12/20/2016
 
Sphingosine 1-phosphate receptor 1
Name:Sphingosine 1-phosphate receptor 1
Type:Enzyme
Mol. Mass.:42836.02
Organism:Homo sapiens (Human)
Description:P21453
Residue:382
BDBM65195
NameBDBM65195
Synonyms:US10166249, Example 537 | US9522888, 537
Typen/a
Emp. Form.C21H34NO4PS
Mol. Mass.427.538
SMILESCC(C)SCC[C@@H]1CCc2cc(ccc2C1)[C@H]1CC[C@](N)(COP(O)(O)=O)C1