Reaction Details
TargetSphingosine 1-phosphate receptor 1
LigandBDBM65316
Substrate/Competitorn/a
Meas. Tech.hS1P1ERK Phosphorylation Assay
Temperature310.15±n/a K
EC50 550±n/a nM
Commentsextracted
Citation Dyckman, AJDhar, TGXiao, HGilmore, JLYang, MGXiao, ZMarcoux, D Substituted bicyclic compounds US Patent US9522888 Publication Date 12/20/2016
 
Sphingosine 1-phosphate receptor 1
Name:Sphingosine 1-phosphate receptor 1
Type:Enzyme
Mol. Mass.:42836.02
Organism:Homo sapiens (Human)
Description:P21453
Residue:382
BDBM65316
NameBDBM65316
Synonyms:US10166249, Example 633 | US9522888, 630
Typen/a
Emp. Form.C24H38NO5P
Mol. Mass.451.536
SMILESCCCCC1CCCC2(CCc3cc(ccc3C2)[C@H]2CC[C@](N)(COP(O)(O)=O)C2)O1