Reaction Details
TargetSphingosine 1-phosphate receptor 1
LigandBDBM65320
Substrate/Competitorn/a
Meas. Tech.hS1P1ERK Phosphorylation Assay
Temperature310.15±n/a K
EC50<10±n/a nM
Commentsextracted
Citation Dyckman, AJDhar, TGXiao, HGilmore, JLYang, MGXiao, ZMarcoux, D Substituted bicyclic compounds US Patent US9522888 Publication Date 12/20/2016
 
Sphingosine 1-phosphate receptor 1
Name:Sphingosine 1-phosphate receptor 1
Type:Enzyme
Mol. Mass.:42836.02
Organism:Homo sapiens (Human)
Description:P21453
Residue:382
BDBM65320
NameBDBM65320
Synonyms:US10166249, Example 635 | US9522888, 635
Typen/a
Emp. Form.C20H30NO5P
Mol. Mass.395.4297
SMILESCCCCC1CCc2cc(ccc2C1=O)[C@H]1CC[C@](N)(COP(O)(O)=O)C1