Reaction Details
TargetSphingosine 1-phosphate receptor 3
LigandBDBM65347
Substrate/Competitorn/a
Meas. Tech.[35S] GTPgammaS Binding Assays
Temperature333.15±n/a K
EC50>625±n/a nM
Commentsextracted
Citation Dyckman, AJDhar, TGXiao, HGilmore, JLYang, MGXiao, ZMarcoux, D Substituted bicyclic compounds US Patent US9522888 Publication Date 12/20/2016
 
Sphingosine 1-phosphate receptor 3
Name:Sphingosine 1-phosphate receptor 3
Type:G Protein-Coupled Receptor (GPCR)
Mol. Mass.:42278.13
Organism:Homo sapiens (Human)
Description:Q99500
Residue:378
BDBM65347
NameBDBM65347
Synonyms:US10166249, Example 655 | US9522888, 655
Typen/a
Emp. Form.C22H34NO4P
Mol. Mass.407.4834
SMILESCCC\C=C/C[C@H]1CCc2cc(ccc2C1)[C@H]1CC[C@](N)(COP(O)(O)=O)C1