Reaction Details
TargetMelanin-concentrating hormone receptor 1 [E4Q,A5T]
LigandBDBM258762
Substrate/Competitorn/a
Meas. Tech.Radioligand Binding Assay
pH7.4±n/a
Ki 0.5±n/a nM
Commentsextracted
Citation Washburn, WNMurugaiah Subbaiah, MAAhmad, S Pyrrolone or pyrrolidinone melanin concentrating hormone receptor-1 antagonists US Patent US9499482 Publication Date 11/22/2016
 
Melanin-concentrating hormone receptor 1 [E4Q,A5T]
Name:Melanin-concentrating hormone receptor 1 [E4Q,A5T]
Type:Enzyme
Mol. Mass.:46077.38
Organism:Homo sapiens (Human)
Description:Q99705 (E4Q, A5T)
Residue:422
BDBM258762
NameBDBM258762
Synonyms:US9499482, 161
TypeSmall organic molecule
Emp. Form.C27H32N2O5
Mol. Mass.464.5534
SMILESCOc1cc(ccc1OCCN1CC(C)(C1)OC)N1CC=C(Oc2ccc(cc2)C2CC2)C1=O