Reaction Details
TargetMelanin-concentrating hormone receptor 1 [E4Q,A5T]
LigandBDBM258771
Substrate/Competitorn/a
Meas. Tech.Radioligand Binding Assay
pH7.4±n/a
Ki 0.6±n/a nM
Commentsextracted
Citation Washburn, WNMurugaiah Subbaiah, MAAhmad, S Pyrrolone or pyrrolidinone melanin concentrating hormone receptor-1 antagonists US Patent US9499482 Publication Date 11/22/2016
 
Melanin-concentrating hormone receptor 1 [E4Q,A5T]
Name:Melanin-concentrating hormone receptor 1 [E4Q,A5T]
Type:Enzyme
Mol. Mass.:46077.38
Organism:Homo sapiens (Human)
Description:Q99705 (E4Q, A5T)
Residue:422
BDBM258771
NameBDBM258771
Synonyms:US9499482, 171
TypeSmall organic molecule
Emp. Form.C31H39N3O5
Mol. Mass.533.6585
SMILESCCc1cc(ccc1OCCN1CC(C1)NC(=O)OC(C)(C)C)N1CC=C(Oc2ccc(cc2)C2CC2)C1=O