Reaction Details
TargetMelanin-concentrating hormone receptor 1 [E4Q,A5T]
LigandBDBM258798
Substrate/Competitorn/a
Meas. Tech.Radioligand Binding Assay
pH7.4±n/a
Ki 0.7±n/a nM
Commentsextracted
Citation Washburn, WNMurugaiah Subbaiah, MAAhmad, S Pyrrolone or pyrrolidinone melanin concentrating hormone receptor-1 antagonists US Patent US9499482 Publication Date 11/22/2016
 
Melanin-concentrating hormone receptor 1 [E4Q,A5T]
Name:Melanin-concentrating hormone receptor 1 [E4Q,A5T]
Type:Enzyme
Mol. Mass.:46077.38
Organism:Homo sapiens (Human)
Description:Q99705 (E4Q, A5T)
Residue:422
BDBM258798
NameBDBM258798
Synonyms:US9499482, 217
TypeSmall organic molecule
Emp. Form.C29H30N2O5
Mol. Mass.486.5589
SMILESCOc1cc(ccc1OCCN1CC(C)(O)C1)N1CC=C(Oc2ccc(cc2)-c2ccccc2)C1=O