Reaction Details
TargetDual specificity protein kinase TTK/Glutathione S-transferase P
LigandBDBM259472
Substrate/Competitorn/a
Meas. Tech.Time-Resolved Fluorescence Resonance Energy Transfer (TR-FRET) Assay
pH7.7±n/a
Temperature295.15±n/a K
IC50 0.5±n/a nM
Commentsextracted
Citation Koppitz, MKlar, UWengner, AMNeuhaus, RSiemeister, G Substituted imidazopyridazines US Patent US9512126 Publication Date 12/6/2016
 
Dual specificity protein kinase TTK/Glutathione S-transferase P
Name:Dual specificity protein kinase TTK/Glutathione S-transferase P
Synonyms:GST-Dual specificity protein kinase TTK
Type:Protein
Mol. Mass.:n/a
Description:n/a
Components:This complex has 2 components.
Component 1
Name:Glutathione S-transferase P
Type:Enzyme
Mol. Mass.:23353.53
Organism:Homo sapiens (Human)
Description:P09211
Residue:210
Component 2
Name:Dual specificity protein kinase TTK
Synonyms:Dual specificity protein kinase (TTK) MPS1 Monopolar Spindle 1 (MPS1) Monopolar Spindle 1 Kinase (MPS1) TTK | TTK_HUMAN
Type:Protein
Mol. Mass.:97086.79
Organism:Homo sapiens (Human)
Description:P33981
Residue:857
BDBM259472
NameBDBM259472
Synonyms:US9512126, 10
TypeSmall organic molecule
Emp. Form.C29H28F3N5O2
Mol. Mass.535.5601
SMILESCOc1ccc(cc1)C(=C)c1cc(NCCC(F)(F)F)c2ncc(-c3ccc(C(=O)NC4CC4)c(C)c3)n2n1