Reaction Details
TargetGlutaminyl-peptide cyclotransferase
LigandBDBM259899
Substrate/Competitorn/a
Meas. Tech.Fluorometric Assays
pH8±n/a
Temperature303.15±n/a K
Ki 6.5399±n/a nM
Commentsextracted
Citation Heiser, UBuchholz, MSommer, RMeyer, ADemuth, H Inhibitors US Patent US9512115 Publication Date 12/6/2016
 
Glutaminyl-peptide cyclotransferase
Name:Glutaminyl-peptide cyclotransferase
Type:Enzyme
Mol. Mass.:40877.05
Organism:Homo sapiens (Human)
Description:Q16769
Residue:361
BDBM259899
NameBDBM259899
Synonyms:US9512115, 2
TypeSmall organic molecule
Emp. Form.C19H16F3N3O3
Mol. Mass.391.3438
SMILESFC(F)CCOc1ccc([C@H]2COC(=O)N2c2ccc3[nH]cnc3c2)c(F)c1