Reaction Details
TargetGlutaminyl-peptide cyclotransferase
LigandBDBM259904
Substrate/Competitorn/a
Meas. Tech.Fluorometric Assays
pH8±n/a
Temperature303.15±n/a K
Ki 10.871±n/a nM
Commentsextracted
Citation Heiser, UBuchholz, MSommer, RMeyer, ADemuth, H Inhibitors US Patent US9512115 Publication Date 12/6/2016
 
Glutaminyl-peptide cyclotransferase
Name:Glutaminyl-peptide cyclotransferase
Type:Enzyme
Mol. Mass.:40877.05
Organism:Homo sapiens (Human)
Description:Q16769
Residue:361
BDBM259904
NameBDBM259904
Synonyms:US9512115, 7
TypeSmall organic molecule
Emp. Form.C20H19F2N3O3
Mol. Mass.387.38
SMILESCC(C)(F)COc1ccc([C@H]2COC(=O)N2c2ccc3[nH]cnc3c2)c(F)c1