Reaction Details
TargetCannabinoid receptor 2
LigandBDBM260128
Substrate/Competitorn/a
Meas. Tech.cAMP Assay
Temperature310.15±n/a K
EC50 0.1±n/a nM
Commentsextracted
Citation Frei, BGobbi, LGrether, UKimbara, ANettekoven, MRoever, SRogers-Evans, MSchulz-Gasch, T Pyridine derivatives US Patent US9522886 Publication Date 12/20/2016
 
Cannabinoid receptor 2
Name:Cannabinoid receptor 2
Type:G Protein-Coupled Receptor (GPCR)
Mol. Mass.:39690.94
Organism:Homo sapiens (Human)
Description:P34972
Residue:360
BDBM260128
NameBDBM260128
Synonyms:US9522886, 76 | US9522886, 81
TypeSmall organic molecule
Emp. Form.C21H22FN3O4S
Mol. Mass.431.48
SMILESNC(=O)CC1(CS(=O)(=O)C1)NC(=O)c1ccc(C2CC2)c(Cc2ccc(F)cc2)n1