Reaction Details
TargetCannabinoid receptor 1
LigandBDBM260061
Substrate/Competitorn/a
Meas. Tech.cAMP Assay
Temperature310.15±n/a K
EC50>10000±n/a nM
Commentsextracted
Citation Frei, BGobbi, LGrether, UKimbara, ANettekoven, MRoever, SRogers-Evans, MSchulz-Gasch, T Pyridine derivatives US Patent US9522886 Publication Date 12/20/2016
 
Cannabinoid receptor 1
Name:Cannabinoid receptor 1
Type:G Protein-Coupled Receptor (GPCR)
Mol. Mass.:52868.96
Organism:Homo sapiens (Human)
Description:P21554
Residue:472
BDBM260061
NameBDBM260061
Synonyms:US9522886, 10 | US9522886, 9
TypeSmall organic molecule
Emp. Form.C20H29N3O3
Mol. Mass.359.4626
SMILESCCCCC(CC(N)=O)NC(=O)c1ccc(C2CC2)c(OCC2CC2)n1