Reaction Details
TargetTyrosine-protein kinase ABL1 [T315I]
LigandBDBM260155
Substrate/Competitorn/a
Meas. Tech.Enzyme Assay
IC50<20±n/a nM
Citation Chilov, GGTitov, IY Protein kinase inhibitors (variants), use thereof in treating oncological diseases and a pharmaceutical composition based thereon US Patent US9522910 Publication Date 12/20/2016
 
Tyrosine-protein kinase ABL1 [T315I]
Name:Tyrosine-protein kinase ABL1 [T315I]
Type:n/a
Mol. Mass.:122909.35
Organism:Homo sapiens (Human)
Description:P00519 (T315I)
Residue:1130
BDBM260155
NameBDBM260155
Synonyms:US9522910, Table 1 Compound 5: 4-methyl-N-{4-[(4-methylpiperazin-1-yl)methyl]-3-(trifluoromethyl)phenyl}-3-(2-{[1,2,4]triazolo[4,3-b]pyridazin-3-yl}ethynyl)benzamide
TypeSmall organic molecule
Emp. Form.C28H26F3N7O
Mol. Mass.533.5475
SMILESCN1CCN(Cc2ccc(NC(=O)c3ccc(C)c(c3)C#Cc3nnc4cccnn34)cc2C(F)(F)F)CC1