Reaction Details
TargetVasopressin V1b receptor
LigandBDBM260213
Substrate/Competitorn/a
Meas. Tech.Binding Assay
pH7.4±n/a
Temperature277.15±n/a K
IC50 2.4±n/a nM
Commentsextracted
Citation Yoshinaga, MKuwada, TMiyakoshi, NIshizaka, TWakasugi, DShirokawa, SHattori, NShimazaki, Y Azole derivative US Patent US9522914 Publication Date 12/20/2016
 
Vasopressin V1b receptor
Name:Vasopressin V1b receptor
Type:Enzyme
Mol. Mass.:46985.01
Organism:Homo sapiens (Human)
Description:P47901
Residue:424
BDBM260213
NameBDBM260213
Synonyms:US9522914, A-15
TypeSmall organic molecule
Emp. Form.C30H37FN4O3
Mol. Mass.520.6382
SMILESCOc1cc(ccc1F)-c1nc(cn1CC(=O)NC(C)C)-c1ccc(CCN2C3CCC2CC(O)C3)cc1