Reaction Details
TargetVasopressin V1b receptor
LigandBDBM260308
Substrate/Competitorn/a
Meas. Tech.Binding Assay
pH7.4±n/a
Temperature277.15±n/a K
IC50 2.2±n/a nM
Commentsextracted
Citation Yoshinaga, MKuwada, TMiyakoshi, NIshizaka, TWakasugi, DShirokawa, SHattori, NShimazaki, Y Azole derivative US Patent US9522914 Publication Date 12/20/2016
 
Vasopressin V1b receptor
Name:Vasopressin V1b receptor
Type:Enzyme
Mol. Mass.:46985.01
Organism:Homo sapiens (Human)
Description:P47901
Residue:424
BDBM260308
NameBDBM260308
Synonyms:US9522914, C-19
TypeSmall organic molecule
Emp. Form.C26H31ClN4O3
Mol. Mass.483.002
SMILESCC(C)NC(=O)Cn1c(cn(-c2ccc(CCN3CCOCC3)cc2)c1=O)-c1cccc(Cl)c1