Reaction Details
TargetVasopressin V1b receptor
LigandBDBM260316
Substrate/Competitorn/a
Meas. Tech.Binding Assay
pH7.4±n/a
Temperature277.15±n/a K
IC50 2.5±n/a nM
Commentsextracted
Citation Yoshinaga, MKuwada, TMiyakoshi, NIshizaka, TWakasugi, DShirokawa, SHattori, NShimazaki, Y Azole derivative US Patent US9522914 Publication Date 12/20/2016
 
Vasopressin V1b receptor
Name:Vasopressin V1b receptor
Type:Enzyme
Mol. Mass.:46985.01
Organism:Homo sapiens (Human)
Description:P47901
Residue:424
BDBM260316
NameBDBM260316
Synonyms:US9522914, D-05
TypeSmall organic molecule
Emp. Form.C27H34FN5O4
Mol. Mass.511.5884
SMILESCOc1cc(ccc1F)-n1c(CC(=O)NC(C)(C)C)nn(-c2ccc(CCN3CCOCC3)cc2)c1=O