Reaction Details
TargetVasopressin V1b receptor
LigandBDBM260341
Substrate/Competitorn/a
Meas. Tech.Binding Assay
pH7.4±n/a
Temperature277.15±n/a K
IC50 2.8±n/a nM
Commentsextracted
Citation Yoshinaga, MKuwada, TMiyakoshi, NIshizaka, TWakasugi, DShirokawa, SHattori, NShimazaki, Y Azole derivative US Patent US9522914 Publication Date 12/20/2016
 
Vasopressin V1b receptor
Name:Vasopressin V1b receptor
Type:Enzyme
Mol. Mass.:46985.01
Organism:Homo sapiens (Human)
Description:P47901
Residue:424
BDBM260341
NameBDBM260341
Synonyms:US9522914, D-30
TypeSmall organic molecule
Emp. Form.C26H31ClFN5O3
Mol. Mass.516.007
SMILESCC(C)(C)NC(=O)Cc1nn(-c2ccc(CCN3CCOCC3)cc2)c(=O)n1-c1ccc(F)c(Cl)c1