Reaction Details
TargetTyrosine-protein kinase JAK1
LigandBDBM260478
Substrate/Competitorn/a
Meas. Tech.In Vitro Kinase Assay
pH7.3±n/a
Temperature300.15±n/a K
IC50 0.2±n/a nM
Commentsextracted
Citation Zhang, XDong, QLiu, BZhu, YLi, XLan, J Pyrrole six-membered heteroaryl ring derivative, preparation method thereof, and medicinal uses thereof US Patent US9527851 Publication Date 12/27/2016
 
Tyrosine-protein kinase JAK1
Name:Tyrosine-protein kinase JAK1
Type:Protein
Mol. Mass.:133293.73
Organism:Homo sapiens (Human)
Description:P23458
Residue:1154
BDBM260478
NameBDBM260478
Synonyms:US10428074, Example 125 US9527851, 49 | US9527851, example 125
TypeSmall organic molecule
Emp. Form.C20H24N8OS
Mol. Mass.424.523
SMILESCN([C@@H]1C[C@H]2CN(C[C@H]2C1)C(=O)Nc1nc(ns1)C1CC1)c1ncnc2[nH]ccc12