Reaction Details
TargetTyrosine-protein kinase JAK2
LigandBDBM260459
Substrate/Competitorn/a
Meas. Tech.In Vitro Kinase Assay
pH7.3±n/a
Temperature300.15±n/a K
IC50 3±n/a nM
Commentsextracted
Citation Zhang, XDong, QLiu, BZhu, YLi, XLan, J Pyrrole six-membered heteroaryl ring derivative, preparation method thereof, and medicinal uses thereof US Patent US9527851 Publication Date 12/27/2016
 
Tyrosine-protein kinase JAK2
Name:Tyrosine-protein kinase JAK2
Type:Protein
Mol. Mass.:130684.68
Organism:Homo sapiens (Human)
Description:O60674
Residue:1132
BDBM260459
NameBDBM260459
Synonyms:US10428074, Example 17 US9527851, example 17
TypeSmall organic molecule
Emp. Form.C17H23N5O2
Mol. Mass.329.3968
SMILESC[C@H](O)C(=O)N1C[C@@H]2C[C@H](C[C@@H]2C1)N(C)c1ncnc2[nH]ccc12