Reaction Details
TargetIntegrin alpha-4/Integrin beta-1/Vascular cell adhesion protein 1
LigandBDBM260689
Substrate/Competitorn/a
Meas. Tech.Binding Inhibition Assay
pH9.6±n/a
Temperature277.15±n/a K
IC50 150±n/a nM
Commentsextracted
Citation Ueno, HYamamoto, TTakashita, RYokoyama, RSugiura, TKageyama, SAndo, AEda, HEviryanti, AMiyazawa, TKirihara, ATanabe, INakamura, TNoguchi, MShuto, MSugiki, MDohi, M Sulfonamide derivative and medicinal use thereof US Patent US9533985 Publication Date 1/3/2017
 
Integrin alpha-4/Integrin beta-1/Vascular cell adhesion protein 1
Name:Integrin alpha-4/Integrin beta-1/Vascular cell adhesion protein 1
Synonyms:Vascular cell adhesion protein 1 (VCAM-1)/Alpha-4 Beta-1 Integrin
Type:Enzyme
Mol. Mass.:n/a
Description:n/a
Components:This complex has 3 components.
Component 1
Name:Vascular cell adhesion protein 1
Type:Other Protein Type
Mol. Mass.:81259.16
Organism:Homo sapiens (Human)
Description:P19320
Residue:739
Component 2
Name:Integrin alpha-4
Synonyms:CD49 antigen-like family member D CD49d antigen ITA4_HUMAN Integrin alpha-4 Integrin alpha-IV VLA-4 integrin alpha 4 precursor | integrin alpha-4 precursor
Type:Membrane Protein
Mol. Mass.:114897.35
Organism:Homo sapiens (Human)
Description:P13612
Residue:1032
Component 3
Name:Integrin beta-1
Synonyms:CD_antigen=CD29 Fibronectin receptor beta GPIIA ITGB1 MDF2 | MSK12
Type:Enzyme
Mol. Mass.:88400.38
Organism:Homo sapiens (Human)
Description:P05556
Residue:798
BDBM260689
NameBDBM260689
Synonyms:US9533985, 77
TypeSmall organic molecule
Emp. Form.C33H26F2N8O7S
Mol. Mass.716.671
SMILESCn1cnc2n(C)c(=O)n(-c3ccc(C[C@H](NC(=O)c4c(F)cc(NS(=O)(=O)c5ccc(cc5)-c5ncccn5)cc4F)C(O)=O)cc3)c(=O)c12