Reaction Details
TargetRho-associated protein kinase 1
LigandBDBM163433
Substrate/Competitorn/a
Meas. Tech.Fluorescent Polarization Assay
Temperature296.15±n/a K
IC50 21000±0 nM
Commentsextracted
Citation McKerracher, LBond, LM Treatment of cerebral cavernous malformations and cerebral aneurysms with Rho kinase inhibitors US Patent US9687483 Publication Date 6/27/2017
 
Rho-associated protein kinase 1
Name:Rho-associated protein kinase 1
Type:Protein
Mol. Mass.:159610.34
Organism:Rattus norvegicus (Rat)
Description:Q63644
Residue:1369
BDBM163433
NameBDBM163433
Synonyms:BA-1049 US9687483, 1
TypeSmall organic molecule
Emp. Form.C16H21N3O2S
Mol. Mass.319.422
SMILESC[C@@H](N)C1CCN(CC1)S(=O)(=O)c1cccc2cnccc12