Reaction Details
TargetPeriod circadian protein homolog 2
LigandBDBM50140703
Substrate/Competitorn/a
Meas. Tech.High-Throughput Circadian Assay
EC50 742±n/a nM
Citation Bersot, RHumphries, P Carbazole-containing sulfonamides as cryptochrome modulators US Patent US10383880 Publication Date 8/20/2019
 
Period circadian protein homolog 2
Name:Period circadian protein homolog 2
Type:PROTEIN
Mol. Mass.:136576.47
Organism:Homo sapiens (Human)
Description:ChEMBL_116705
Residue:1255
BDBM50140703
NameBDBM50140703
Synonyms:CHEMBL3754134 | US10383880, Example 2
TypeSmall organic molecule
Emp. Form.C22H24N2O4S
Mol. Mass.412.502
SMILESCCS(=O)(=O)N(CC(O)Cn1c2ccccc2c2ccccc12)Cc1ccco1